{"text_format":"3","workbook":"xlsx","n_sheets":2,"sheets":["NOVATOS E INTERMEDIOS","CLASIFICADOS"],"not_rendered":{"comments":2},"read":"whole","date_system":"1900"}

{"sheet":"NOVATOS E INTERMEDIOS","index":0,"n_rows":107,"n_cols":85,"rows_kept":107}
[null,null,"PUNTUACION MEJORES CLUBES 2025 FORMATIVO"]
[null,null,"CLUB",null,"CURSO DE ACREDITACION DE ARBITRAJE QUITO -14 DE DICIEMBRE 2024","CURSO DE ACREDITACION DE ENTRENADORES QUITO 15-19 DE ENERO 2025","COPA ALDUPE QUITO 01-02 DE FEBRERO 2025","OPEN PROVINCIAL  NOVATOS INFANTIL A QUITO 01-MARZO-2025","OPEN PROVINCIAL  NOVATOS INFANTIL B QUITO 01-MARZO-2025","OPEN PROVINCIAL  NOVATOS CADETES QUITO 01-MARZO-2025","OPEN PROVINCIAL  NOVATOS  JUNIOR QUITO 01-MARZO-2025","OPEN PROVINCIAL  NOVATOS SENIOR Y MASTER QUITO 01-MARZO-2025","OPEN PROVINCIAL INTERMEDIOS A QUITO 01-MARZ0-2025","OPEN PROVINCIAL INTERMEDIOS B QUITO 01-MARZ0-2025","OPEN PROVINCIAL INTERMEDIOS CADETES QUITO 01-MARZ0-2025","OPEN PROVINCIAL INTERMEDIOS JUNIOR QUITO 01-MARZ0-2025","OPEN PROVINCIAL INTERMEDIOS SENIOR Y MSTER QUITO 01-MARZ0-2025","OPEN PROVINCIAL POOMSAE NOVATOS E  INTERMEDIOS´´ A ´´QUITO 01-MARZ0-2025","OPEN PROVINCIAL POOMSAE NOVATOS E  INTERMEDIOS´´ B´´ QUITO 01-MARZ0-2025","OPEN PROVINCIAL POOMSAE NOVATOS E  INTERMEDIOS CADETES QUITO 01-MARZ0-2025","OPEN PROVINCIAL POOMSAE NOVATOS E  INTERMEDIOS JUNIOR QUITO 01-MARZ0-2025","OPEN PROVINCIAL POOMSAE  NOVATOS E INTERMEDIOS SENIOR QUITO 01-MARZ0-2025","COPA YONG TIGER QUITO 22 DE MARZO DEL 2025","FESTIVAL DE HABILIDADES MOTRICES 05 DE ABRIL DEL 2025","COPA DECIAP QUITO 19 DE ABRIL DEL 2025","COPA TOTAL KOMBAT QUITO 25 DE MAYO DEL 2025","OPEN PROVINCIAL  NOVATOS INFANTIL A QUITO 05-06 DE JULIO-2025","OPEN PROVINCIAL  NOVATOS INFANTIL B QUITO 05-06 DE JULIO-2025","OPEN PROVINCIAL  NOVATOS CADETES QUITO 05-06 DE JULIO2025","OPEN PROVINCIAL  NOVATOS  JUNIOR QUITO 05-06 DE JULIO 2025","OPEN PROVINCIAL  NOVATOS SENIOR Y MASTER QUITO 05-06 DE JULIO2025","OPEN PROVINCIAL INTERMEDIOS A QUITO 05-06 DE JULIO 2025","OPEN PROVINCIAL INTERMEDIOS B QUITO 05-06 DE JULIO 2025","OPEN PROVINCIAL INTERMEDIOS CADETES QUITO 05 06 DE JULIO 2025","OPEN PROVINCIAL INTERMEDIOS JUNIOR QUITO 05-06 DE JULIO 2025","OPEN PROVINCIAL INTERMEDIOS SENIOR Y MSTER QUITO 05-06 DE JULIO 2025","OPEN PROVINCIAL POOMSAE NOVATOS E  INTERMEDIOS´´ A ´´QUITO 05-06 DE JULIO 2025","OPEN PROVINCIAL POOMSAE NOVATOS E  INTERMEDIOS´´ B´´ QUITO 05-06 DE JULIO 2025","OPEN PROVINCIAL POOMSAE NOVATOS E  INTERMEDIOS CADETES QUITO 05-06 DE JULIO 2025","OPEN PROVINCIAL POOMSAE NOVATOS E  INTERMEDIOS JUNIOR QUITO 05-06 DE JULIO 2025","OPEN PROVINCIAL POOMSAE  NOVATOS E INTERMEDIOS SENIOR QUITO 05-06 JULIO 2025","CURSO DE ACTUALIZACION DE ARBITRAJE QUITO 18-19 DE JULIO DEL 2025","OPEN HAGMADANG QUTIO 08 DE AGOSTO DEL 2025","COPA SEUL QUITO 17 DE AGOSTO DEL 2025",{"$nulls":37},"PUNTAJE TOTAL","UBICACIÓN","CLUB","PUNTAJE"]
[-1E-8,{"$f":"_xlfn.RANK.AVG(D3,$D$3:$D$103,0)","v":4},"APOLO",{"$f":"CD3+A3*ROW()","v":{"v":228.99999997,"d":"229"}},0,20,5,0,0,0,0,0,0,0,0,0,0,17,25,14,3,0,5,26,0,5,7,0,0,0,0,0,0,0,0,0,25,20,14,1,25,12,0,5,{"$nulls":37},{"$f":"SUM(E3:CC3)","v":229},1,{"$f":"VLOOKUP(CE3,'NOVATOS E INTERMEDIOS'!$B$3:$C$103,2,FALSE)","v":"BAEKJUL BG"},{"$f":"VLOOKUP(CF3,'NOVATOS E INTERMEDIOS'!$C$3:$CD$103,2,FALSE)","v":{"v":353.99999976,"d":"354"}}]
[-2E-8,10,"ARES",{"v":138.99999992,"d":"139"},6,22,5,0,0,0,0,0,0,0,0,0,14,0,0,0,17,0,0,18,5,5,0,0,7,7,11,0,null,0,0,0,0,0,0,0,1,2,14,5,{"$nulls":37},139,{"$f":"CE3+1","v":2},{"$f":"VLOOKUP(CE4,'NOVATOS E INTERMEDIOS'!$B$3:$C$103,2,FALSE)","v":"S.D.CENTRAL"},{"$f":"VLOOKUP(CF4,'NOVATOS E INTERMEDIOS'!$C$3:$CD$103,2,FALSE)","v":{"v":283.9999496,"d":"284"}}]
[-3e-08,32,"ATLAS CLUB",{"v":49.99999985,"d":"50"},4,4,0,0,0,0,0,0,0,0,1,14,0,0,0,0,0,0,0,0,0,0,0,0,0,0,0,0,0,0,17,0,0,0,0,0,0,10,0,0,{"$nulls":37},50,3,{"$f":"VLOOKUP(CE5,'NOVATOS E INTERMEDIOS'!$B$3:$C$103,2,FALSE)","v":"DEBAK TKD"},{"$f":"VLOOKUP(CF5,'NOVATOS E INTERMEDIOS'!$C$3:$CD$103,2,FALSE)","v":{"v":248.99999712,"d":"249"}}]
[-4e-08,1,"BAEKJUL BG",{"v":353.99999976,"d":"354"},8,14,5,25,11,20,0,0,17,0,0,17,0,0,0,25,0,0,0,58,0,5,25,20,0,0,0,25,0,0,0,0,0,0,20,0,20,34,0,5,{"$nulls":37},354,4,{"$f":"VLOOKUP(CE6,'NOVATOS E INTERMEDIOS'!$B$3:$C$103,2,FALSE)","v":"APOLO"},{"$f":"VLOOKUP(CF6,'NOVATOS E INTERMEDIOS'!$C$3:$CD$103,2,FALSE)","v":{"v":228.99999997,"d":"229"}}]
[-5e-08,21,"BAS PANTHER",{"v":87.99999965,"d":"88"},18,14,5,7,0,0,0,0,0,0,0,0,0,0,0,0,1,0,0,20,5,5,3,0,0,0,0,0,0,0,0,0,0,0,0,0,0,10,0,0,{"$nulls":37},88,5,{"$f":"VLOOKUP(CE7,'NOVATOS E INTERMEDIOS'!$B$3:$C$103,2,FALSE)","v":"JOSEON LEGACY"},{"$f":"VLOOKUP(CF7,'NOVATOS E INTERMEDIOS'!$C$3:$CD$103,2,FALSE)","v":{"v":210.9999848,"d":"211"}}]
[-6e-08,18,"BORJA´S LIONS",{"v":104.99999952,"d":"105"},0,16,0,0,0,0,0,0,0,0,0,0,0,0,0,0,0,0,0,0,0,5,0,0,0,0,7,11,14,0,11,0,11,25,3,0,0,2,0,0,{"$nulls":37},105,6,{"$f":"VLOOKUP(CE8,'NOVATOS E INTERMEDIOS'!$B$3:$C$103,2,FALSE)","v":"TOTAL KOMBAT"},{"$f":"VLOOKUP(CF8,'NOVATOS E INTERMEDIOS'!$C$3:$CD$103,2,FALSE)","v":{"v":190.9999172,"d":"191"}}]
[-7e-08,14,"BLUE DRAGONS",{"v":122.99999937,"d":"123"},0,16,5,3,1,0,0,0,14,14,25,0,0,0,0,0,0,0,5,0,0,0,0,0,0,0,0,14,1,7,0,0,0,0,0,0,0,18,0,0,{"$nulls":37},123,7,{"$f":"VLOOKUP(CE9,'NOVATOS E INTERMEDIOS'!$B$3:$C$103,2,FALSE)","v":"MERCENARIOS"},{"$f":"VLOOKUP(CF9,'NOVATOS E INTERMEDIOS'!$C$3:$CD$103,2,FALSE)","v":{"v":185.99996865,"d":"186"}}]
[-8e-08,41,"CIUDAD DE QUITO",{"v":32.9999992,"d":"33"},0,6,5,0,0,0,0,0,0,0,0,0,0,0,0,0,0,0,0,4,0,0,0,0,0,0,0,0,0,14,0,0,0,0,0,0,0,4,0,0,{"$nulls":37},33,8,{"$f":"VLOOKUP(CE10,'NOVATOS E INTERMEDIOS'!$B$3:$C$103,2,FALSE)","v":"LOS PUMAS"},{"$f":"VLOOKUP(CF10,'NOVATOS E INTERMEDIOS'!$C$3:$CD$103,2,FALSE)","v":{"v":159.99997192,"d":"160"}}]
[-9e-08,78,"CONDOR",{"v":3.99999901,"d":"4"},0,4,0,0,0,0,0,0,0,0,0,0,0,0,0,0,0,0,0,0,0,0,0,0,0,0,0,0,0,0,0,0,0,0,0,0,0,0,0,0,{"$nulls":37},4,9,{"$f":"VLOOKUP(CE11,'NOVATOS E INTERMEDIOS'!$B$3:$C$103,2,FALSE)","v":"KO AMERICA"},{"$f":"VLOOKUP(CF11,'NOVATOS E INTERMEDIOS'!$C$3:$CD$103,2,FALSE)","v":{"v":142.99998152,"d":"143"}}]
[-1e-07,85,"CLUB MIKIDO",{"v":1.9999988,"d":"2"},0,2,0,0,0,0,0,0,0,0,0,0,0,0,0,0,0,0,0,0,0,0,0,0,0,0,0,0,0,0,0,0,0,0,0,0,0,0,0,0,{"$nulls":37},2,10,{"$f":"VLOOKUP(CE12,'NOVATOS E INTERMEDIOS'!$B$3:$C$103,2,FALSE)","v":"ARES"},{"$f":"VLOOKUP(CF12,'NOVATOS E INTERMEDIOS'!$C$3:$CD$103,2,FALSE)","v":{"v":138.99999992,"d":"139"}}]
[-1.1e-07,95,"CHEN HUU",{"v":-1.43e-06,"d":"-0"},0,0,0,0,0,0,0,0,0,0,0,0,0,0,0,0,0,0,0,0,0,0,0,0,0,0,0,0,0,0,0,0,0,0,0,0,0,0,0,0,{"$nulls":37},0,11,{"$f":"VLOOKUP(CE13,'NOVATOS E INTERMEDIOS'!$B$3:$C$103,2,FALSE)","v":"SEUL"},{"$f":"VLOOKUP(CF13,'NOVATOS E INTERMEDIOS'!$C$3:$CD$103,2,FALSE)","v":{"v":136.99994376,"d":"137"}}]
[-1.2e-07,55,"CHONKWON",{"v":19.99999832,"d":"20"},0,0,0,0,0,0,0,0,0,0,0,0,20,0,0,0,0,0,0,0,0,0,0,0,0,0,0,0,0,0,0,0,0,0,0,0,0,0,0,0,{"$nulls":37},20,12,{"$f":"VLOOKUP(CE14,'NOVATOS E INTERMEDIOS'!$B$3:$C$103,2,FALSE)","v":"CHUNG SONG"},{"$f":"VLOOKUP(CF14,'NOVATOS E INTERMEDIOS'!$C$3:$CD$103,2,FALSE)","v":{"v":134.99999805,"d":"135"}}]
[-1.3E-7,12,"CHUNG SONG",{"v":134.99999805,"d":"135"},4,6,5,0,17,25,0,0,0,0,0,0,0,0,14,0,0,0,0,0,5,0,0,25,0,17,0,0,7,0,0,0,0,0,0,0,0,10,0,0,{"$nulls":37},135,13,{"$f":"VLOOKUP(CE15,'NOVATOS E INTERMEDIOS'!$B$3:$C$103,2,FALSE)","v":"LEON"},{"$f":"VLOOKUP(CF15,'NOVATOS E INTERMEDIOS'!$C$3:$CD$103,2,FALSE)","v":{"v":127.999976,"d":"128"}}]
[-1.4e-07,15,"CHAMPIONS FOR LIFE",{"v":122.99999776,"d":"123"},2,6,5,0,0,0,0,0,11,0,0,0,17,25,3,0,0,0,5,8,5,5,0,0,0,0,0,0,0,0,0,11,0,14,0,0,0,6,0,0,{"$nulls":37},123,14,{"$f":"VLOOKUP(CE16,'NOVATOS E INTERMEDIOS'!$B$3:$C$103,2,FALSE)","v":"BLUE DRAGONS"},{"$f":"VLOOKUP(CF16,'NOVATOS E INTERMEDIOS'!$C$3:$CD$103,2,FALSE)","v":{"v":122.99999937,"d":"123"}}]
[-1.5e-07,72,"DAIGORO",{"v":5.99999745,"d":"6"},0,6,0,0,0,0,0,0,0,0,0,0,0,0,0,0,0,0,0,0,0,0,0,0,0,0,0,0,0,0,0,0,0,0,0,0,0,0,0,0,{"$nulls":37},6,15,{"$f":"VLOOKUP(CE17,'NOVATOS E INTERMEDIOS'!$B$3:$C$103,2,FALSE)","v":"CHAMPIONS FOR LIFE"},{"$f":"VLOOKUP(CF17,'NOVATOS E INTERMEDIOS'!$C$3:$CD$103,2,FALSE)","v":{"v":122.99999776,"d":"123"}}]
[-1.6E-7,3,"DEBAK TKD",{"v":248.99999712,"d":"249"},0,32,5,1,20,11,7,17,0,11,0,1,0,0,17,17,11,0,5,20,0,5,0,0,0,0,1,0,0,11,0,0,0,17,17,0,11,12,0,0,{"$nulls":37},249,16,{"$f":"VLOOKUP(CE18,'NOVATOS E INTERMEDIOS'!$B$3:$C$103,2,FALSE)","v":"HAN KUM DO"},{"$f":"VLOOKUP(CF18,'NOVATOS E INTERMEDIOS'!$C$3:$CD$103,2,FALSE)","v":{"v":118.99998845,"d":"119"}}]
[-1.7e-07,47,"DECIAP",{"v":28.99999677,"d":"29"},0,14,5,0,0,0,0,0,0,0,0,0,0,0,0,0,0,0,5,0,5,0,0,0,0,0,0,0,0,0,0,0,0,0,0,0,0,0,0,0,{"$nulls":37},29,17,{"$f":"VLOOKUP(CE19,'NOVATOS E INTERMEDIOS'!$B$3:$C$103,2,FALSE)","v":"TAEKWONDO TRAINING CENTER"},{"$f":"VLOOKUP(CF19,'NOVATOS E INTERMEDIOS'!$C$3:$CD$103,2,FALSE)","v":{"v":108.99992945,"d":"109"}}]
[-1.8E-7,25,"DOJAN TAEKWONDO MELO",{"v":64.9999964,"d":"65"},4,4,0,0,0,0,0,0,0,0,0,0,0,0,20,11,0,0,0,0,0,0,0,0,0,0,0,0,0,0,0,0,7,3,11,3,0,2,0,0,{"$nulls":37},65,18,{"$f":"VLOOKUP(CE20,'NOVATOS E INTERMEDIOS'!$B$3:$C$103,2,FALSE)","v":"BORJA´S LIONS"},{"$f":"VLOOKUP(CF20,'NOVATOS E INTERMEDIOS'!$C$3:$CD$103,2,FALSE)","v":{"v":104.99999952,"d":"105"}}]
[-1.9e-07,31,"DRACO",{"v":53.99999601,"d":"54"},0,8,5,0,0,0,0,0,0,0,0,0,0,0,0,0,0,0,5,16,0,0,0,0,0,0,0,0,20,0,0,0,0,0,0,0,0,0,0,0,{"$nulls":37},54,19,{"$f":"VLOOKUP(CE21,'NOVATOS E INTERMEDIOS'!$B$3:$C$103,2,FALSE)","v":"PYONG YANG"},{"$f":"VLOOKUP(CF21,'NOVATOS E INTERMEDIOS'!$C$3:$CD$103,2,FALSE)","v":{"v":98.99995776,"d":"99"}}]
[-2e-07,50,"DRAGON GYM",{"v":22.9999956,"d":"23"},0,6,5,0,0,0,0,0,7,0,0,0,0,0,0,0,0,0,0,0,0,5,0,0,0,0,0,0,0,0,0,0,0,0,0,0,0,0,0,0,{"$nulls":37},23,20,{"$f":"VLOOKUP(CE22,'NOVATOS E INTERMEDIOS'!$B$3:$C$103,2,FALSE)","v":"MINOTAUROS"},{"$f":"VLOOKUP(CF22,'NOVATOS E INTERMEDIOS'!$C$3:$CD$103,2,FALSE)","v":{"v":88.9999652,"d":"89"}}]
[-2.1E-7,86,"DRAGON LEE GYM",{"v":1.99999517,"d":"2"},0,2,0,0,0,0,0,0,0,0,0,0,0,0,0,0,0,0,0,0,0,0,0,0,0,0,0,0,0,0,0,0,0,0,0,0,0,0,0,0,{"$nulls":37},2,21,{"$f":"VLOOKUP(CE23,'NOVATOS E INTERMEDIOS'!$B$3:$C$103,2,FALSE)","v":"BAS PANTHER"},{"$f":"VLOOKUP(CF23,'NOVATOS E INTERMEDIOS'!$C$3:$CD$103,2,FALSE)","v":{"v":87.99999965,"d":"88"}}]
[-2.2e-07,24,"ECUACUBA",{"v":73.99999472,"d":"74"},4,8,5,0,0,0,0,0,0,0,0,0,0,0,0,0,0,0,5,0,0,5,0,0,0,3,0,3,0,0,0,17,17,0,0,7,0,0,0,0,{"$nulls":37},74,22,{"$f":"VLOOKUP(CE24,'NOVATOS E INTERMEDIOS'!$B$3:$C$103,2,FALSE)","v":"SURYUN"},{"$f":"VLOOKUP(CF24,'NOVATOS E INTERMEDIOS'!$C$3:$CD$103,2,FALSE)","v":{"v":84.99993917,"d":"85"}}]
[-2.3e-07,33,"ECUADOR",{"v":48.99999425,"d":"49"},0,20,0,0,0,0,0,0,0,0,0,0,0,0,0,0,0,0,0,0,0,0,0,0,0,0,0,0,0,0,0,0,0,0,0,0,7,22,0,0,{"$nulls":37},49,23,{"$f":"VLOOKUP(CE25,'NOVATOS E INTERMEDIOS'!$B$3:$C$103,2,FALSE)","v":"ESPE"},{"$f":"VLOOKUP(CF25,'NOVATOS E INTERMEDIOS'!$C$3:$CD$103,2,FALSE)","v":{"v":75.99999325,"d":"76"}}]
[-2.4e-07,62,"EQUILIBRIO",{"v":14.99999376,"d":"15"},4,6,0,0,0,0,0,0,0,0,0,0,3,0,0,0,0,0,0,0,0,0,0,0,0,0,0,0,0,0,0,0,0,0,0,0,0,2,0,0,{"$nulls":37},15,24,{"$f":"VLOOKUP(CE26,'NOVATOS E INTERMEDIOS'!$B$3:$C$103,2,FALSE)","v":"ECUACUBA"},{"$f":"VLOOKUP(CF26,'NOVATOS E INTERMEDIOS'!$C$3:$CD$103,2,FALSE)","v":{"v":73.99999472,"d":"74"}}]
[-2.5e-07,23,"ESPE",{"v":75.99999325,"d":"76"},2,20,0,0,0,0,0,0,0,0,0,0,25,0,0,0,0,0,0,0,5,0,0,0,0,0,17,0,0,0,0,1,0,0,0,0,0,6,0,0,{"$nulls":37},76,25,{"$f":"VLOOKUP(CE27,'NOVATOS E INTERMEDIOS'!$B$3:$C$103,2,FALSE)","v":"DOJAN TAEKWONDO MELO"},{"$f":"VLOOKUP(CF27,'NOVATOS E INTERMEDIOS'!$C$3:$CD$103,2,FALSE)","v":{"v":64.9999964,"d":"65"}}]
[-2.6E-7,73,"FRANG",{"v":5.99999272,"d":"6"},0,2,0,0,0,0,0,0,0,0,0,0,0,0,0,0,0,0,0,2,0,0,0,0,0,0,0,0,0,0,0,0,0,0,0,0,0,2,0,0,{"$nulls":37},6,26,{"$f":"VLOOKUP(CE28,'NOVATOS E INTERMEDIOS'!$B$3:$C$103,2,FALSE)","v":"KUKKIKWON"},{"$f":"VLOOKUP(CF28,'NOVATOS E INTERMEDIOS'!$C$3:$CD$103,2,FALSE)","v":{"v":60.99997885,"d":"61"}}]
[-2.7e-07,69,"FIT KWON DO",{"v":8.99999217,"d":"9"},0,4,0,0,0,0,0,0,0,0,0,0,0,0,0,0,0,0,0,0,0,5,0,0,0,0,0,0,0,0,0,0,0,0,0,0,0,0,0,0,{"$nulls":37},9,27,{"$f":"VLOOKUP(CE29,'NOVATOS E INTERMEDIOS'!$B$3:$C$103,2,FALSE)","v":"KYORUGUI GYM"},{"$f":"VLOOKUP(CF29,'NOVATOS E INTERMEDIOS'!$C$3:$CD$103,2,FALSE)","v":{"v":60.99997697,"d":"61"}}]
[-2.8e-07,57,"FIRST CLASS CALDERON",{"v":17.9999916,"d":"18"},0,6,0,0,0,0,0,0,0,0,0,0,0,0,0,0,0,0,5,0,0,5,0,0,0,0,0,0,0,0,0,0,0,0,0,0,0,2,0,0,{"$nulls":37},18,28,{"$f":"VLOOKUP(CE30,'NOVATOS E INTERMEDIOS'!$B$3:$C$103,2,FALSE)","v":"TAE BAEK ECUADOR JR"},{"$f":"VLOOKUP(CF30,'NOVATOS E INTERMEDIOS'!$C$3:$CD$103,2,FALSE)","v":{"v":58.99993601,"d":"59"}}]
{"$rows_left_out":78}
{"sheet":"CLASIFICADOS","index":1,"n_rows":103,"n_cols":52,"rows_kept":103}
[null,null,"PUNTUACION MEJORES CLUBES 2025 CLASIFICADOS"]
[null,null,"CLUB",null,"USA. OPEN CHAMPIONS 14-16 FEBRERO 2025 COMBATE G2","USA. OPEN CHAMPIONS 14-16 FEBRERO 2025 POOMSAE G2","ECUADOR SERIES PORTOVIEJO 20-23 DE FEBRERO 2025 COMBATE CLASIFICADOS","ECUADOR SERIES PORTOVIEJO 20-23 DE FEBRERO 2025 POOMSAE CLASIFICADOS","CAMPEONATO NACIONAL CADETES PORTOVIEJO DEL 14-16 DE MARZO DEL 2025","CAMPEONATO NACIONAL JUNIOR PORTOVIEJO DEL 28-30 DE MARZO DEL 2025","CAMPEONATO PANAMERICANO QUERETARO DEL 3-6 DE ABRIL DEL 2025","PANAM SERIES QUERATARO DEL 3-6 DE ABRIL DEL 2025 POOMSAE","PANAM SERIES QUERATARO DEL 3-6 DE ABRIL DEL 2025 COMBATE"," OPEN PANAMERICANO QUERETARO DEL 3-6 DE ABRIL DEL 2025 POOMSAE G1","CAMPEONATO NACIONAL JUVENIL U22  LOJA  DEL 02-04 DE MAYO DEL 2025","CAMPEONATO MUNDIAL DE CATES DUBAI 09-11 DE MAYO DEL 2025","COPA COREA QUITO 17 DE MAYO DEL 2025 CATEGORIA AVANZADOS","JUEGOS MUNDIALES MASTER CHINA TIAPIE 24-28 DE MAYO DEL 2025 COMBATE","JUEGOS MUNDIALES MASTER CHINA TIAPIE 24-28 DE MAYO DEL 2025 POOMSAE","CAMPEONATO NACIONAL INFANTIL QUITO DEL 14-16 DE JUNIO DEL 2025","JUEGOS NACIONALES CICLO JUVENIL PORTOVIEJO 28 DE JUNIO AL 02 DE JULIO DEL 2025","JUEGOS PANAMERICANOS PARAGUAY DEL 15 AL 17 DE AGOSTO","ECUADOR CHALLENGER QUITO 12 AL 14 DE SEPTIEMBRE DEL 2025","PRESIDENT CUP LIMA- PERU 04 AL 07 DE SEPTIEMBRE DEL 2025",{"$nulls":24},"PUNTAJE TOTAL","UBICACIÓN","CLUB","PUNTAJE"]
[-1E-8,{"$f":"_xlfn.RANK.AVG(D3,$D$3:$D$103,0)","v":44},"APOLO",{"$f":"AW3+A3*ROW()","v":{"v":-3.0000000000000004E-8,"d":"-0"}},0,0,0,0,0,0,0,0,0,0,0,0,0,0,0,0,0,0,{"$nulls":26},{"$f":"SUM(E3:AV3)","v":0},1,{"$f":"VLOOKUP(AX3,CLASIFICADOS!$B$3:$C$103,2,FALSE)","v":"SEUL"},{"$f":"VLOOKUP(AY3,CLASIFICADOS!$C$3:$AW$103,2,FALSE)","v":{"v":171.99994525,"d":"172"}}]
[-2E-8,24,"ARES",{"v":15.99999992,"d":"16"},0,0,2,0,10,0,0,0,0,0,0,0,4,0,0,0,0,0,{"$nulls":26},16,{"$f":"AX3+1","v":2},{"$f":"VLOOKUP(AX4,CLASIFICADOS!$B$3:$C$103,2,FALSE)","v":"DEBAK TKD"},{"$f":"VLOOKUP(AY4,CLASIFICADOS!$C$3:$AW$103,2,FALSE)","v":{"v":161.99999712,"d":"162"}}]
[-3e-08,45,"ATLAS CLUB",{"v":-1.5e-07,"d":"-0"},0,0,0,0,0,0,0,0,0,0,0,0,0,0,0,0,0,0,{"$nulls":26},0,3,{"$f":"VLOOKUP(AX5,CLASIFICADOS!$B$3:$C$103,2,FALSE)","v":"MERCENARIOS"},{"$f":"VLOOKUP(AY5,CLASIFICADOS!$C$3:$AW$103,2,FALSE)","v":{"v":125.99996976,"d":"126"}}]
[-4e-08,14,"BAEKJUL BG",{"v":35.99999976,"d":"36"},0,0,18,0,8,0,0,0,0,0,0,0,4,0,0,6,0,0,{"$nulls":26},36,4,{"$f":"VLOOKUP(AX6,CLASIFICADOS!$B$3:$C$103,2,FALSE)","v":"DECIAP"},{"$f":"VLOOKUP(AY6,CLASIFICADOS!$C$3:$AW$103,2,FALSE)","v":{"v":113.99999677,"d":"114"}}]
[-5e-08,12,"BAS PANTHER",{"v":40.99999965,"d":"41"},0,0,8,2,15,8,0,0,0,0,0,0,2,0,0,6,0,0,{"$nulls":26},41,5,{"$f":"VLOOKUP(AX7,CLASIFICADOS!$B$3:$C$103,2,FALSE)","v":"S.D.CENTRAL"},{"$f":"VLOOKUP(AY7,CLASIFICADOS!$C$3:$AW$103,2,FALSE)","v":{"v":110.99995101,"d":"111"}}]
[-6e-08,7,"BORJA´S LIONS",{"v":87.99999952,"d":"88"},0,0,2,0,16,30,0,0,0,0,0,0,6,0,0,34,0,0,{"$nulls":26},88,6,{"$f":"VLOOKUP(AX8,CLASIFICADOS!$B$3:$C$103,2,FALSE)","v":"KORYO"},{"$f":"VLOOKUP(AY8,CLASIFICADOS!$C$3:$AW$103,2,FALSE)","v":{"v":91.99998065,"d":"92"}}]
[-7e-08,46,"BLUE DRAGONS",{"v":-6.3E-7,"d":"-0"},0,0,0,0,0,0,0,0,0,0,0,0,0,0,0,0,0,0,{"$nulls":26},0,7,{"$f":"VLOOKUP(AX9,CLASIFICADOS!$B$3:$C$103,2,FALSE)","v":"BORJA´S LIONS"},{"$f":"VLOOKUP(AY9,CLASIFICADOS!$C$3:$AW$103,2,FALSE)","v":{"v":87.99999952,"d":"88"}}]
[-8e-08,47,"CIUDAD DE QUITO",{"v":-8e-07,"d":"-0"},0,0,0,0,0,0,0,0,0,0,0,0,0,0,0,0,0,0,{"$nulls":26},0,8,{"$f":"VLOOKUP(AX10,CLASIFICADOS!$B$3:$C$103,2,FALSE)","v":"HAN SU"},{"$f":"VLOOKUP(AY10,CLASIFICADOS!$C$3:$AW$103,2,FALSE)","v":{"v":55.99998912,"d":"56"}}]
[-9e-08,48,"CONDOR",{"v":-9.9e-07,"d":"-0"},0,0,0,0,0,0,0,0,0,0,0,0,0,0,0,0,0,0,{"$nulls":26},0,9,{"$f":"VLOOKUP(AX11,CLASIFICADOS!$B$3:$C$103,2,FALSE)","v":"DRACO"},{"$f":"VLOOKUP(AY11,CLASIFICADOS!$C$3:$AW$103,2,FALSE)","v":{"v":54.99999601,"d":"55"}}]
[-1e-07,49,"CLUB MIKIDO",{"v":-1.2e-06,"d":"-0"},0,0,0,0,0,0,0,0,0,0,0,0,0,0,0,0,0,0,{"$nulls":26},0,10,{"$f":"VLOOKUP(AX12,CLASIFICADOS!$B$3:$C$103,2,FALSE)","v":"YONG TIGER"},{"$f":"VLOOKUP(AY12,CLASIFICADOS!$C$3:$AW$103,2,FALSE)","v":{"v":54.99990397,"d":"55"}}]
[-1.1e-07,50,"CHEN HUU",{"v":-1.43e-06,"d":"-0"},0,0,0,0,0,0,0,0,0,0,0,0,0,0,0,0,0,0,{"$nulls":26},0,11,{"$f":"VLOOKUP(AX13,CLASIFICADOS!$B$3:$C$103,2,FALSE)","v":"KO AMERICA"},{"$f":"VLOOKUP(AY13,CLASIFICADOS!$C$3:$AW$103,2,FALSE)","v":{"v":42.99998237,"d":"43"}}]
[-1.2e-07,51,"CHONKWON",{"v":-1.6799999999999998E-6,"d":"-0"},0,0,0,0,0,0,0,0,0,0,0,0,0,0,0,0,0,0,{"$nulls":26},0,12,{"$f":"VLOOKUP(AX14,CLASIFICADOS!$B$3:$C$103,2,FALSE)","v":"BAS PANTHER"},{"$f":"VLOOKUP(AY14,CLASIFICADOS!$C$3:$AW$103,2,FALSE)","v":{"v":40.99999965,"d":"41"}}]
[-1.3E-7,52,"CHUNG SONG",{"v":-1.95E-6,"d":"-0"},0,0,0,0,0,0,0,0,0,0,0,0,0,0,0,0,0,0,{"$nulls":26},0,13,{"$f":"VLOOKUP(AX15,CLASIFICADOS!$B$3:$C$103,2,FALSE)","v":"TAEKWONDO TRAINING CENTER"},{"$f":"VLOOKUP(AY15,CLASIFICADOS!$C$3:$AW$103,2,FALSE)","v":{"v":37.99993112,"d":"38"}}]
[-1.4e-07,20,"CHAMPIONS FOR LIFE",{"v":21.99999776,"d":"22"},0,0,0,0,0,0,0,0,0,0,10,0,0,0,0,0,12,0,{"$nulls":26},22,14,{"$f":"VLOOKUP(AX16,CLASIFICADOS!$B$3:$C$103,2,FALSE)","v":"BAEKJUL BG"},{"$f":"VLOOKUP(AY16,CLASIFICADOS!$C$3:$AW$103,2,FALSE)","v":{"v":35.99999976,"d":"36"}}]
[-1.5e-07,35,"DAIGORO",{"v":1.99999745,"d":"2"},0,0,0,0,0,0,0,0,0,0,0,0,2,0,0,0,0,0,{"$nulls":26},2,15,{"$f":"VLOOKUP(AX17,CLASIFICADOS!$B$3:$C$103,2,FALSE)","v":"ILYOP MP"},{"$f":"VLOOKUP(AY17,CLASIFICADOS!$C$3:$AW$103,2,FALSE)","v":{"v":35.99998705,"d":"36"}}]
[-1.6E-7,2,"DEBAK TKD",{"v":161.99999712,"d":"162"},0,6,10,14,0,0,0,0,0,17,8,0,10,0,85,12,0,0,{"$nulls":26},162,16,{"$f":"VLOOKUP(AX18,CLASIFICADOS!$B$3:$C$103,2,FALSE)","v":"ROJAS  IRON FIRST"},{"$f":"VLOOKUP(AY18,CLASIFICADOS!$C$3:$AW$103,2,FALSE)","v":{"v":35.9999524,"d":"36"}}]
[-1.7e-07,4,"DECIAP",{"v":113.99999677,"d":"114"},0,0,4,6,14,8,12,0,3,0,7,30,2,0,0,6,12,10,{"$nulls":26},114,17,{"$f":"VLOOKUP(AX19,CLASIFICADOS!$B$3:$C$103,2,FALSE)","v":"TAE SHO KU"},{"$f":"VLOOKUP(AY19,CLASIFICADOS!$C$3:$AW$103,2,FALSE)","v":{"v":26.9999344,"d":"27"}}]
[-1.8E-7,36,"DOJAN TAEKWONDO MELO",{"v":1.9999964,"d":"2"},0,0,0,2,0,0,0,0,0,0,0,0,0,0,0,0,0,0,{"$nulls":26},2,18,{"$f":"VLOOKUP(AX20,CLASIFICADOS!$B$3:$C$103,2,FALSE)","v":"ECUACUBA"},{"$f":"VLOOKUP(AY20,CLASIFICADOS!$C$3:$AW$103,2,FALSE)","v":{"v":25.99999472,"d":"26"}}]
[-1.9e-07,9,"DRACO",{"v":54.99999601,"d":"55"},0,0,8,0,0,19,0,0,0,0,0,0,4,0,0,24,0,0,{"$nulls":26},55,19,{"$f":"VLOOKUP(AX21,CLASIFICADOS!$B$3:$C$103,2,FALSE)","v":"SIM JANG TEAM"},{"$f":"VLOOKUP(AY21,CLASIFICADOS!$C$3:$AW$103,2,FALSE)","v":{"v":25.99994225,"d":"26"}}]
[-2e-07,53,"DRAGON GYM",{"v":-4.4e-06,"d":"-0"},0,0,0,0,0,0,0,0,0,0,0,0,0,0,0,0,0,0,{"$nulls":26},0,20,{"$f":"VLOOKUP(AX22,CLASIFICADOS!$B$3:$C$103,2,FALSE)","v":"CHAMPIONS FOR LIFE"},{"$f":"VLOOKUP(AY22,CLASIFICADOS!$C$3:$AW$103,2,FALSE)","v":{"v":21.99999776,"d":"22"}}]
[-2.1E-7,54,"DRAGON LEE GYM",{"v":-4.83e-06,"d":"-0"},0,0,0,0,0,0,0,0,0,0,0,0,0,0,0,0,0,0,{"$nulls":26},0,21,{"$f":"VLOOKUP(AX23,CLASIFICADOS!$B$3:$C$103,2,FALSE)","v":"LIGA CANTONAL MEJIA"},{"$f":"VLOOKUP(AY23,CLASIFICADOS!$C$3:$AW$103,2,FALSE)","v":{"v":19.999976,"d":"20"}}]
[-2.2e-07,18,"ECUACUBA",{"v":25.99999472,"d":"26"},0,0,0,0,7,0,0,0,0,0,0,0,2,0,0,17,0,0,{"$nulls":26},26,22,{"$f":"VLOOKUP(AX24,CLASIFICADOS!$B$3:$C$103,2,FALSE)","v":"TAE DO ACADEMY"},{"$f":"VLOOKUP(AY24,CLASIFICADOS!$C$3:$AW$103,2,FALSE)","v":{"v":19.99993277,"d":"20"}}]
[-2.3e-07,55,"ECUADOR",{"v":-5.75E-6,"d":"-0"},0,0,0,0,0,0,0,0,0,0,0,0,0,0,0,0,0,0,{"$nulls":26},0,23,{"$f":"VLOOKUP(AX25,CLASIFICADOS!$B$3:$C$103,2,FALSE)","v":"KUNGAN DUL"},{"$f":"VLOOKUP(AY25,CLASIFICADOS!$C$3:$AW$103,2,FALSE)","v":{"v":17.99997885,"d":"18"}}]
[-2.4e-07,56,"EQUILIBRIO",{"v":-6.2399999999999995E-6,"d":"-0"},0,0,0,0,0,0,0,0,0,0,0,0,0,0,0,0,0,0,{"$nulls":26},0,24,{"$f":"VLOOKUP(AX26,CLASIFICADOS!$B$3:$C$103,2,FALSE)","v":"ARES"},{"$f":"VLOOKUP(AY26,CLASIFICADOS!$C$3:$AW$103,2,FALSE)","v":{"v":15.99999992,"d":"16"}}]
[-2.5e-07,57,"ESPE",{"v":-6.75e-06,"d":"-0"},0,0,0,0,0,0,0,0,0,0,0,0,0,0,0,0,0,0,{"$nulls":26},0,25,{"$f":"VLOOKUP(AX27,CLASIFICADOS!$B$3:$C$103,2,FALSE)","v":"LOS PUMAS"},{"$f":"VLOOKUP(AY27,CLASIFICADOS!$C$3:$AW$103,2,FALSE)","v":{"v":12.99997297,"d":"13"}}]
[-2.6E-7,37,"FRANG",{"v":1.99999272,"d":"2"},0,0,0,0,0,0,0,0,0,0,0,0,2,0,0,0,0,0,{"$nulls":26},2,26,{"$f":"VLOOKUP(AX28,CLASIFICADOS!$B$3:$C$103,2,FALSE)","v":"FIRST CLASS CALDERON"},{"$f":"VLOOKUP(AY28,CLASIFICADOS!$C$3:$AW$103,2,FALSE)","v":{"v":11.9999916,"d":"12"}}]
[-2.7e-07,58,"FIT KWON DO",{"v":-7.83e-06,"d":"-0"},0,0,0,0,0,0,0,0,0,0,0,0,0,0,0,0,0,0,{"$nulls":26},0,27,{"$f":"VLOOKUP(AX29,CLASIFICADOS!$B$3:$C$103,2,FALSE)","v":"JI DO KWAN "},{"$f":"VLOOKUP(AY29,CLASIFICADOS!$C$3:$AW$103,2,FALSE)","v":{"v":11.99998632,"d":"12"}}]
[-2.8e-07,26,"FIRST CLASS CALDERON",{"v":11.9999916,"d":"12"},0,0,0,0,6,0,0,0,0,0,0,0,6,0,0,0,0,0,{"$nulls":26},12,28,{"$f":"VLOOKUP(AX30,CLASIFICADOS!$B$3:$C$103,2,FALSE)","v":"KYORUGUI GYM"},{"$f":"VLOOKUP(AY30,CLASIFICADOS!$C$3:$AW$103,2,FALSE)","v":{"v":11.99997792,"d":"12"}}]
{"$rows_left_out":73}